{"text_format":"2","workbook":"xlsx","n_sheets":2,"sheets":["výsledky","List3"],"not_rendered":{"charts":0,"images":0,"macros":0,"external_links":1,"defined_names":2,"comments":0,"pivot_tables":0},"unopened":[],"bounds":{"document_bytes":16777216,"sheet_cells":100000,"run_cost":"one","rows_first":2000,"rows_last":500,"rows_between":2000,"halvings":0,"cell_chars":16384,"cell_head_chars":4096},"cells_cut":0,"cells_raw":0,"read":"whole","date_system":"1900"}

{"sheet":"výsledky","index":0,"n_rows":104,"n_cols":18,"rows_kept":104,"cut":false,"hidden":false,"merged":[[78,15,79,15],[78,16,79,16],[78,14,79,14],[0,0,0,13],[1,0,1,13],[2,0,2,13]]}
["Výsledky NOB smíšených dvojic"]
["Datum a místo konání: Praha Hostivař, 23. 4. 2015"]
["Pořadatel: http://www.priro.eu"]
[]
["Kategorie K - krátká"]
["Pořadí","Příjmení","Jméno","VŠ","fakulta","Příjmení ","Jméno","VŠ","fakulta",{"$nulls":4},"výsledný čas"]
["1.","Krausová","Katka","UK","2. LF","Bauer","Tomáš",null,null,7,"00:30:00",8,"01:11:40","00:41:40"]
["2.","Vágnerová","Tereza","Absolvent",null,"Johanovský","Tomáš","Absolvent",null,1,"00:00:00",1,"00:47:51","00:47:51"]
["3.","Čtveráková","Iveta","UK","PřF","Lžíčař","Martin","Absolvent",null,6,"00:25:00",9,"01:13:12","00:48:12"]
["4.","Daňhová","Veronika","JČU",null,"Šimbera","Jan","UK","PřF",6,"00:25:00",11,"01:15:26","00:50:26"]
["5.","Pantůčková","Klára","UK","PřF","Klanica","Radek","UK","PřF",7,"00:30:00",16,"01:21:42","00:51:42"]
["6.","Kociánová","Barbora","UK","MFF","Hauptfleisch","Filip","UK","MFF",7,"00:30:00",17,"01:21:50","00:51:50"]
["7.","Měchurová","Kristýna","UK","PřF","Razím","Matyáš","UK","PřF",2,"00:05:00",2,"00:58:29","00:53:29"]
["8.","Steklíková","Klára","UK","PřF","Kubelka","Vojtěch","UK","PřF",7,"00:30:00",20,"01:24:05","00:54:05"]
["9.","Kovářová","Kristýna","UK","PřF","Havlíček","Vojta","UK","PřF",4,"00:15:00",6,"01:09:21","00:54:21"]
["10.","Fajstová","Alena","Absolvent","FF","Stehlík","Petr","Absolvent",null,3,"00:10:00",5,"01:07:00","00:57:00"]
["11.","Loukotova","Sarka","UK","PřF","Michetschlager","Lukas","UK","PřF",6,"00:25:00",21,"01:24:25","00:59:25"]
["12.","Kvasničková","Anežka","VŠCHT",null,"Balouch","Martin","UK","PřF",5,"00:20:00",13,"01:19:45","00:59:45"]
["13.","Perlíková","Pavla","Absolvent","PřF","Perlík","Martin","Absolvent",null,2,"00:05:00",4,"01:05:40","01:00:40"]
["14.","Vajnerová ","Věra","UK","1. LF","Svatoň","Karel","UK","3.LF",4,"00:15:00",14,"01:20:12","01:05:12"]
["15.","Šídová","Kateřina","UK","PřF","Krupka","Jáchym","Jiná",null,6,"00:25:00",30,"01:34:26","01:09:26"]
["16.","Kočová","Lenka","UK","PedF","Samuel","Pečenka","UK","PřF",1,"00:00:00",7,"01:09:50","01:09:50"]
["17.","Kalasová","Ilona","UK","PřF","Fiedler","Michal","Absolvent",null,2,"00:05:00",12,"01:17:35","01:12:35"]
["18.","Šustrová","Lenka","UK","PřF","Špicar","Josef","UK","PřF",4,"00:15:00",28,"01:30:09","01:15:09"]
["19.","Novotná","Kateřina","UK","PřF","Hamala","Vojtěch","UK","PřF",5,"00:20:00",31,"01:35:26","01:15:26"]
["20.","Červená","Lucie","UK","PřF","Benda","Jakub","UK","MFF",5,"00:20:00",32,"01:35:28","01:15:28"]
["21.","Kaščáková","Dorota","UK","PřF","Pulmann","Ján","UK","MFF",2,"00:05:00",15,"01:21:09","01:16:09"]
["22.","Škvorová","Rebeka","ČVUT","FBMI","Škvor","Daniel","ČVUT","FIT",8,"00:35:00",55,"01:52:37","01:17:37"]
["23.","Dalecká","Linda","UK","PřF","Ficek","František","UK","PřF",3,"00:10:00",27,"01:30:07","01:20:07"]
["24.","Pilátová","Jitka","UK","3.LF","Kopriva","Tomáš","UK","3.LF",5,"00:20:00",48,"01:44:55","01:24:55"]
["25.","Jančarová","Bára","UK","PřF","Vachuška","Jakub","UK","PřF",3,"00:10:00",37,"01:38:12","01:28:12"]
["26.","Jindrová","Miroslava","UK","PřF","Tauš","Petr","UK","PřF",1,"00:00:00",24,"01:29:15","01:29:15"]
["27.","Kohoutová","Lucie","UK","PřF","Trögel","Martin","UP",null,1,"00:00:00",25,"01:29:25","01:29:25"]
["28.","Vydláková","Alena","UK","PřF","Rusnák","Samo","UK","PřF",5,"00:20:00",68,"02:07:14","01:47:14"]
["DISK","Šestáková","Eliška","UK","MFF","Vácha","Petr","ČVUT",null,3,"00:10:00",56,"01:53:02","01:43:02"]
["DISK","Jeřábková","Tereza","UK","PřF","Rössner","Filip","UK","PřF",6,"00:25:00",74,"02:21:23","01:56:23"]
["DNF","Míčková","Kristýna","UK","PřF","Slavík","Petr","Jiná",null,4,"00:15:00",null,{"$error":"#N/A"},{"$error":"#N/A"}]
["DNF","Novohradská ","Dana","Absolvent",null,"Vrbatová","Gabriela","Absolvent",null,7,"00:30:00",null,{"$error":"#N/A"},{"$error":"#N/A"}]
["DNF","Štěpánková","Petra","ČZU",null,"Humpál","František","ČVUT",null,8,"00:35:00",null,{"$error":"#N/A"},{"$error":"#N/A"}]
[]
[]
["Kategorie E - elita"]
["Pořadí","Příjmení","Jméno","VŠ","fakulta","Příjmení ","Jméno","VŠ","fakulta",{"$nulls":4},"výsledný čas"]
["1.","Prostředníková","Monika","Absolvent",null,"Merta","Ondřej","Absolvent",null,7,"00:30:00",41,"01:41:40","01:11:40"]
["2.","Čermákova","Kristyna","VŠE",null,"Wagner","Libor","ČVUT",null,3,"00:10:00",22,"01:28:31","01:18:31"]
["3.","Hausmannová","Klára","Absolvent",null,"Drahokoupil","Aleš","Jiná",null,7,"00:30:00",54,"01:51:12","01:21:12"]
["4.","Ďáblice","Něžná","VŠE",null,"Větrovský","Tomáš","VŠE",null,2,"00:05:00",23,"01:28:50","01:23:50"]
["5.","Štembergová","Lucka","Absolvent",null,"Štemberg","Milan","Absolvent",null,3,"00:10:00",47,"01:44:52","01:34:52"]
["6.","Smutná","Anežka","UK","MFF","Keresteš","Jiří","UK","MFF",1,"00:00:00",36,"01:37:35","01:37:35"]
["7.","Urbanovská","Aneta","VŠE",null,"Hvězdný","Petr","VŠE",null,8,"00:35:00",78,"02:26:04","01:51:04"]
["8.","Flašarová","Kristýna","UK","PřF","Krause","David","UK","PřF",2,"00:35:00",79,"02:34:50","01:59:50"]
["DISK","Bahnová","Dana","ČZU",null,"Spilka","Petr","ČZU",null,1,"00:00:00",65,"02:03:26","02:03:26"]
["DISK","Bělousová","Niki","UK","PřF","Šefc","Michal","Absolvent",null,2,"00:05:00",70,"02:11:03","02:06:03"]
["DISK","Jánská","Alena","VŠE",null,"Nepraš","Vláďa","VŠE",null,1,"00:00:00",71,"02:12:12","02:12:12"]
["DNF","Nováková","Terezie","UK","PřF","Uhlíř","Marek","UK","PřF",3,"00:10:00",null,{"$error":"#N/A"},{"$error":"#N/A"}]
[]
["Kategorie D - dlouhá"]
["Pořadí","Příjmení","Jméno","VŠ","fakulta","Příjmení ","Jméno","VŠ","fakulta",{"$nulls":4},"výsledný čas"]
["1.","Mechlová","Lenka","Jiná",null,"Janda","Martin","Jiná",null,2,"00:05:00",3,"01:01:56","00:56:56"]
["2.","Jebavá","Lucka","UK","PřF","Kučera","Michal","UK","PřF",3,"00:10:00",18,"01:22:28","01:12:28"]
["3.","Silovská","Hana","Absolvent",null,"Černý","Ondřej","Absolvent",null,3,"00:10:00",19,"01:23:55","01:13:55"]
["4.","Chejnovská","Anna","UK",null,"Polášek","Petr","UK",null,1,"00:00:00",10,"01:14:30","01:14:30"]
["5.","Středová","Lucie","Absolvent",null,"Beneš","Michal","Absolvent",null,4,"00:15:00",26,"01:29:53","01:14:53"]
["6.","Mikova","Hanka","ČZU",null,"Pliva","Petr","Absolvent",null,4,"00:15:00",44,"01:43:41","01:28:41"]
["7.","Petrmichlová","Lůca","Absolvent",null,"Böck","Adam","Absolvent",null,1,"00:00:00",35,"01:37:16","01:37:16"]
["8.","Modráčková","Jana","UK","PřF","Stoklasa","Michal","UK","PřF",1,"00:00:00",42,"01:43:27","01:43:27"]
["9.","Czepieczová","Miriam","UK","PřF","Krauskopf","Tomáš","UK","PřF",2,"00:05:00",52,"01:49:32","01:44:32"]
["10.","Konečná","Radka","VŠE",null,"Tesař","Pavel","UK","FSV",4,"00:15:00",69,"02:07:35","01:52:35"]
["11.","Habániková","Shannel","UK","PřF","Blahut","Jan","UK","PřF",7,"00:30:00",75,"02:22:47","01:52:47"]
["12.","Zajíčková","Jana","UK","2. LF","Buček","Aleš","UK","PřF",1,"00:00:00",58,"01:53:24","01:53:24"]
["13.","Volencová","Kamila","Absolvent",null,"Adam","Hurta","Absolvent",null,3,"00:10:00",72,"02:12:27","02:02:27"]
["14.","Konvalinková","Tereza","UK","PřF","Michal","Ivo","Absolvent",null,2,"00:05:00",73,"02:14:16","02:09:16"]
["15.","Minichová","Mária","VŠCHT",null,"Jindřich","Mrlík","VŠCHT",null,3,"00:10:00",77,"02:23:15","02:13:15"]
["16.","Marečková","Lucie","UK","PřF","Vaněk","Lukáš","Absolvent","FSV",1,"00:00:00",76,"02:23:10","02:23:10"]
["DNF","Jaroměřská","Tereza","UK","PřF","Zajíček","Jan","Jiná",null,4,"00:15:00",null,{"$error":"#N/A"},{"$error":"#N/A"}]
["DNF","Jandová","Michaela","Absolvent",null,"Skala","David","Absolvent",null,5,"00:20:00",null,{"$error":"#N/A"},{"$error":"#N/A"}]
[]
[]
["Kategorie S - skorelauf",null,null,"Časový limit byl 1:20:00, za každou načatou minutu zpoždění se strhnul 1 bod.",{"$nulls":10},"doběh    v časovém limitu","body za počet kontrol","výsledný počet bodů"]
["Pořadí","Příjmení","Jméno","VŠ","fakulta","Příjmení ","Jméno","VŠ","fakulta",{"$nulls":4},"výsledný čas",null,null,null,"01:20:00"]
["1.","Burgerová","Monika","Absolvent",null,"Ševčík","Jakub","Absolvent",null,7,"00:30:00",46,{"$f":"(VLOOKUP(L81,'[1]Pořadí v cíli'!A$2:B$81,2))","v":"01:44:41"},{"$f":"(VLOOKUP(L81,'[1]Pořadí v cíli'!A$2:B$81,2))-K81","v":"01:14:41"},{"$f":"IF(N81<R$80, \"ANO\", \"NE\")","v":"ANO"},24,24,"z"]
["2.","Cmuntová","Kačka","UK","3.LF","Barvíř","Honza","UK","PřF",5,"00:20:00",34,{"$f":"(VLOOKUP(L82,'[1]Pořadí v cíli'!A$2:B$81,2))","v":"01:36:58"},{"$f":"(VLOOKUP(L82,'[1]Pořadí v cíli'!A$2:B$81,2))-K82","v":"01:16:58"},"ANO",24,24,"z"]
["3.","Hájková","Zuzana","UK","PřF","Rubík","Pavel","UK","PřF",6,"00:25:00",50,{"$f":"(VLOOKUP(L83,'[1]Pořadí v cíli'!A$2:B$81,2))","v":"01:49:22"},{"$f":"(VLOOKUP(L83,'[1]Pořadí v cíli'!A$2:B$81,2))-K83","v":"01:24:22"},"NE",26,21,"z"]
["4.","Hrdá","Hana","ČZU",null,"Křížan","Jiří","Absolvent","PřF",5,"00:20:00",29,{"$f":"(VLOOKUP(L84,'[1]Pořadí v cíli'!A$2:B$81,2))","v":"01:30:47"},{"$f":"(VLOOKUP(L84,'[1]Pořadí v cíli'!A$2:B$81,2))-K84","v":"01:10:47"},"ANO",17,17,"z"]
["5.","Tomková","Johanka","Jiná",null,"Skřivan","Tomáš","UK","MFF",6,"00:25:00",40,{"$f":"(VLOOKUP(L85,'[1]Pořadí v cíli'!A$2:B$81,2))","v":"01:41:20"},{"$f":"(VLOOKUP(L85,'[1]Pořadí v cíli'!A$2:B$81,2))-K85","v":"01:16:20"},"ANO",17,17,"z"]
["6.","Vahalova","Petra","UK","MFF","Hancl","Jaroslav","UK","MFF",7,"00:30:00",62,{"$f":"(VLOOKUP(L86,'[1]Pořadí v cíli'!A$2:B$81,2))","v":"01:59:00"},{"$f":"(VLOOKUP(L86,'[1]Pořadí v cíli'!A$2:B$81,2))-K86","v":"01:29:00"},"NE",26,17,"z"]
["7.","Poesová","Anna","Absolvent",null,"Zeisek","Vojtěch","UK","PřF",6,"00:25:00",43,{"$f":"(VLOOKUP(L87,'[1]Pořadí v cíli'!A$2:B$81,2))","v":"01:43:31"},{"$f":"(VLOOKUP(L87,'[1]Pořadí v cíli'!A$2:B$81,2))-K87","v":"01:18:31"},"ANO",15,15,"z"]
["8.","Barbora","Maroušková","Absolvent",null,"Vít","Maroušek","Absolvent",null,5,"00:20:00",38,{"$f":"(VLOOKUP(L88,'[1]Pořadí v cíli'!A$2:B$81,2))","v":"01:40:11"},{"$f":"(VLOOKUP(L88,'[1]Pořadí v cíli'!A$2:B$81,2))-K88","v":"01:20:11"},"NE",16,15,"z"]
["9.","Honesova","Lenka","UK","PřF","Klouda","Jan","UK","PřF",4,"00:15:00",33,{"$f":"(VLOOKUP(L89,'[1]Pořadí v cíli'!A$2:B$81,2))","v":"01:35:30"},{"$f":"(VLOOKUP(L89,'[1]Pořadí v cíli'!A$2:B$81,2))-K89","v":"01:20:30"},"NE",16,15,"z"]
["10.","Shrbená","Tereza","VŠE",null,"Karlec","Jan","Absolvent",null,7,"00:30:00",57,{"$f":"(VLOOKUP(L90,'[1]Pořadí v cíli'!A$2:B$81,2))","v":"01:53:20"},{"$f":"(VLOOKUP(L90,'[1]Pořadí v cíli'!A$2:B$81,2))-K90","v":"01:23:20"},"NE",19,15,"z"]
["11.","Poláčková","Tereza","UK","PřF","Mašín","David","UK","PřF",6,"00:25:00",51,{"$f":"(VLOOKUP(L91,'[1]Pořadí v cíli'!A$2:B$81,2))","v":"01:49:29"},{"$f":"(VLOOKUP(L91,'[1]Pořadí v cíli'!A$2:B$81,2))-K91","v":"01:24:29"},"NE",17,12,"z"]
["12.","Vařechová","Michaela","Absolvent",null,"Blížil","David","Absolvent",null,7,"00:30:00",49,{"$f":"(VLOOKUP(L92,'[1]Pořadí v cíli'!A$2:B$81,2))","v":"01:46:53"},{"$f":"(VLOOKUP(L92,'[1]Pořadí v cíli'!A$2:B$81,2))-K92","v":"01:16:53"},"ANO",11,11,"z"]
["13.","Roubalová","Markéta","UK","PřF","Zevl","Jiří-Jakub","UK","PřF",5,"00:20:00",39,{"$f":"(VLOOKUP(L93,'[1]Pořadí v cíli'!A$2:B$81,2))","v":"01:41:02"},{"$f":"(VLOOKUP(L93,'[1]Pořadí v cíli'!A$2:B$81,2))-K93","v":"01:21:02"},"NE",10,8,"z"]
["14.","Malečková","Michaela","UK","PřF","Tůma","Pavel","UK","PřF",7,"00:30:00",59,{"$f":"(VLOOKUP(L94,'[1]Pořadí v cíli'!A$2:B$81,2))","v":"01:53:41"},{"$f":"(VLOOKUP(L94,'[1]Pořadí v cíli'!A$2:B$81,2))-K94","v":"01:23:41"},"NE",12,8,"z"]
["15.","Šulcová","Iva","Absolvent",null,"Šabatka","Petr","Absolvent",null,6,"00:25:00",53,{"$f":"(VLOOKUP(L95,'[1]Pořadí v cíli'!A$2:B$81,2))","v":"01:50:11"},{"$f":"(VLOOKUP(L95,'[1]Pořadí v cíli'!A$2:B$81,2))-K95","v":"01:25:11"},"NE",13,7,"z"]
["16.","Patáková","Zuzana","UK","MFF","Paták","Pavel","UK","MFF",4,"00:15:00",60,{"$f":"(VLOOKUP(L96,'[1]Pořadí v cíli'!A$2:B$81,2))","v":"01:54:30"},{"$f":"(VLOOKUP(L96,'[1]Pořadí v cíli'!A$2:B$81,2))-K96","v":"01:39:30"},"NE",26,6,"z"]
["17.","Rimahazi",null,null,null,"Pagáč",null,null,null,7,"00:30:00",61,{"$f":"(VLOOKUP(L97,'[1]Pořadí v cíli'!A$2:B$81,2))","v":"01:56:37"},{"$f":"(VLOOKUP(L97,'[1]Pořadí v cíli'!A$2:B$81,2))-K97","v":"01:26:37"},"NE",11,4,"z"]
["18.","Lněničková","Petra","UK","PřF","Marek","Jakub","UK","PřF",6,"00:25:00",66,{"$f":"(VLOOKUP(L98,'[1]Pořadí v cíli'!A$2:B$81,2))","v":"02:06:32"},{"$f":"(VLOOKUP(L98,'[1]Pořadí v cíli'!A$2:B$81,2))-K98","v":"01:41:32"},"NE",26,4,"z"]
["19.","Palúchová","Miroslava","UK","PřF","Michna","Jan","UK","PřF",6,"00:25:00",64,{"$f":"(VLOOKUP(L99,'[1]Pořadí v cíli'!A$2:B$81,2))","v":"01:59:05"},{"$f":"(VLOOKUP(L99,'[1]Pořadí v cíli'!A$2:B$81,2))-K99","v":"01:34:05"},"NE",16,1,"z"]
["20.","Krejčová","Markéta","UK","PřF","Duben","Ondřej","UK","PřF",6,"00:25:00",63,{"$f":"(VLOOKUP(L100,'[1]Pořadí v cíli'!A$2:B$81,2))","v":"01:59:00"},{"$f":"(VLOOKUP(L100,'[1]Pořadí v cíli'!A$2:B$81,2))-K100","v":"01:34:00"},"NE",5,-9,"z"]
["21.","Řežábková","Karolina","UK","PřF","Šulc","David","UK","PřF",6,"00:25:00",67,{"$f":"(VLOOKUP(L101,'[1]Pořadí v cíli'!A$2:B$81,2))","v":"02:07:11"},{"$f":"(VLOOKUP(L101,'[1]Pořadí v cíli'!A$2:B$81,2))-K101","v":"01:42:11"},"NE",12,-9,"z"]
["DISK","bez partnerky",null,null,null,"Vicek","Pavel","Absolvent",null,4,"00:15:00",45,{"$f":"(VLOOKUP(L102,'[1]Pořadí v cíli'!A$2:B$81,2))","v":"01:43:58"},{"$f":"(VLOOKUP(L102,'[1]Pořadí v cíli'!A$2:B$81,2))-K102","v":"01:28:58"},"NE",18,9,"Mimo soutěž"]
["DNF","Peterová","Lenka","VŠE",null,"Veverka","Pavel","VŠE",null,6,"00:25:00","NEDOŠLI",{"$f":"(VLOOKUP(L103,'[1]Pořadí v cíli'!A$2:B$81,2))","v":{"$error":"#N/A"}},{"$f":"(VLOOKUP(L103,'[1]Pořadí v cíli'!A$2:B$81,2))-K103","v":{"$error":"#N/A"}},"x",0,"-","DNF"]
["DNF","Voženílková","Kristýna","Absolvent",null,"Zemek","Ondřej","UK","PřF",5,"00:20:00",null,{"$f":"(VLOOKUP(L104,'[1]Pořadí v cíli'!A$2:B$81,2))","v":{"$error":"#N/A"}},{"$f":"(VLOOKUP(L104,'[1]Pořadí v cíli'!A$2:B$81,2))-K104","v":{"$error":"#N/A"}},"x",0,"-","DNF"]

{"sheet":"List3","index":1,"n_rows":0,"n_cols":0,"rows_kept":0,"cut":false,"hidden":false,"merged":[]}